=> Bootstrap dependency digest>=20010302: found digest-20111104
===> Building for alsa-lib-1.0.22
Making all in doc
Making all in pictures
gnumake[2]: Nothing to be done for `all'.
gnumake[2]: Nothing to be done for `all-am'.
Making all in include
/usr/bin/gnumake  all-recursive
Making all in sound
gnumake[3]: Nothing to be done for `all'.
Making all in src
Making all in control
if /bin/sh ../../libtool --tag=CC --mode=compile gcc -DHAVE_CONFIG_H -I. -I. -I../../include -I../../include  -no-cpp-precomp -isystem /usr/include -I/usr/include  -pipe -O2 -I/usr/include -D_GNU_SOURCE -MT cards.lo -MD -MP -MF ".deps/cards.Tpo" -c -o cards.lo cards.c; \
	then mv -f ".deps/cards.Tpo" ".deps/cards.Plo"; else rm -f ".deps/cards.Tpo"; exit 1; fi
libtool: compile:  gcc -DHAVE_CONFIG_H -I. -I../../include -no-cpp-precomp -isystem /usr/include -pipe -O2 -D_GNU_SOURCE -MT cards.lo -MD -MP -MF .deps/cards.Tpo -c cards.c  -fno-common -DPIC -o .libs/cards.o
In file included from control_local.h:22,
                 from cards.c:35:
../../include/local.h:43:20: error: endian.h: No such file or directory
In file included from ../../include/local.h:122,
                 from control_local.h:22,
                 from cards.c:35:
../../include/global.h:141: error: redefinition of 'struct timeval'
../../include/global.h:146: error: redefinition of 'struct timespec'
gnumake[2]: *** [cards.lo] Error 1
gnumake[1]: *** [all-recursive] Error 1
gnumake: *** [all-recursive] Error 1
*** Error code 2

Stop.
bmake: stopped in /Users/kristerw/pbulk/pkgsrc/audio/alsa-lib
*** Error code 1

Stop.
bmake: stopped in /Users/kristerw/pbulk/pkgsrc/audio/alsa-lib
